{"text_format":"1","workbook":"xlsx","n_sheets":15,"sheets":["Lists1","Lists2","A1-Rev","A1.1","A2-Rev","A2.1","A3-Rev","A3.1","A4-Rev","A4.1","A5-Rev","A5.1","Section B1-B3 Rev","Referrals and Partners-Rev","Service Locations-Rev"],"not_rendered":{"charts":0,"images":7,"macros":1,"external_links":2,"defined_names":58,"comments":0,"pivot_tables":0},"unopened":[],"bounds":{"document_bytes":16777216,"sheet_cells":100000,"rows_first":2000,"rows_last":500,"rows_between":2000,"halvings":0,"cell_chars":16384,"cell_head_chars":4096},"cells_cut":0,"cells_raw":0,"read":"whole","date_system":"1900"}

{"sheet":"Lists1","index":0,"n_rows":41,"n_cols":4,"rows_kept":41,"cut":false,"hidden":true,"merged":[]}
["Subrecipients",null,"Module 3 Community","Module 4 Family/Individual"]
["Aspermont Small Business Development Center, Inc.",null,"CNPI1 Employment","FNPI1 Employment"]
["Austin HHS",null,"CNPI2 Education & Cognitive Development","FNPI2 Education and Cognitive Development"]
["Big Bend Community Action Committee, Inc.  ",null,"CNPI3 Income & Asset Building","FNPI3 Income and Asset Building"]
["Brazos Valley Community Action Programs",null,"CNPI4 Housing","FNPI4 Housing"]
["Cameron and Willacy",null,"CNPI5 Health & Social/Behavioral","FNPI5 Health and Social/Behavioral"]
["Central Texas Opportunities, Inc.",null,"CNPI6 Civic Engagement & Community Involvement Goal 2","FNPI6 Civic Engagement and Community Involvement"]
["Combined Community Action, Inc.",null,"CNPI6 Civic Engagement & Community Involvement Goal 3"]
["Community Action Committee of Victoria Texas"]
["Community Action Corporation of South Texas"]
["Community Action Inc. of Central Texas ",null,"CNPI1 Employment","CNPI 1a - CNPI 1h"]
["Community Action Social Services & Education",null,"CNPI2 Education & Cognitive Development","CNPI 2a - CNPI 2o"]
["Community Council of Greater Dallas",null,"CNPI3 Income & Asset Building","CNPI 3a - CNPI 3i"]
["Community Council of South Central Texas, Inc.",null,"CNPI4 Housing","CNPI 4a - CNPI 4i"]
["Community Services of Northeast Texas, Inc. ",null,"CNPI5 Health & Social/Behavioral","CNPI 5a - CNPI 5v"]
["Community Services, Inc.",null,"CNPI6 Civic Engagement & Community Involvement Goal 2","CNPI 6 G2a - CNPI 6 G2c"]
["Concho Valley Community Action Agency  ",null,"CNPI6 Civic Engagement & Community Involvement Goal 3","CNPI 6 G3a - CNPI 6 G3b"]
["Economic Action Committee of The Gulf Coast  ",null,"FNPI1 Employment","FNPI 1a - FNPI 1h, FNPI 1z.1"]
["Economic Opportunities Advancement Corporation of Planning Region XI  ",null,"FNPI2 Education and Cognitive Development","FNPI 2a - FNPI 2j"]
["El Paso Community Action Program, Project BRAVO, Inc.  ",null,"FNPI3 Income and Asset Building","FNPI 3a - FNPI 3h"]
{"$rows_left_out":22}
{"sheet":"Lists2","index":1,"n_rows":192,"n_cols":9,"rows_kept":192,"cut":false,"hidden":true,"merged":[]}
["Category","Subcategory","CNPI1","CNPI2","CNPI3","CNPI4","CNPI5","CNPI6G2","CNPI6G3"]
["CNPI1 Employment","CNPI1","CNPI 1a Number of jobs created to increase opportunities for people with low incomes in the identified community.","CNPI 2a Number of accessible and affordable early childhood or pre-school education assets or resource added to the identified community. ","CNPI 3a Number of new accessible assets/resources created in the identified community:","CNPI 4a Number of safe and affordable housing units developed in the identified community (e.g. built or set aside units for people with low incomes).","CNPI 5a Number of accessible and affordable physical health assets or resources created in the identified community. ","CNPI 6 G2a Percent increase of donated time to support the CSBG Eligible Entity's delivery of services and/or implementation of strategies to address conditions of poverty in the identified community. ","CNPI 6 G3a  Percent increase of people with low incomes who support the CSBG Eligible Entity's delivery of service and/or implementation of strategies to address conditions of poverty in the identified community. "]
["CNPI2 Education & Cognitive Development","CNPI2","CNPI 1b Number of job opportunities maintained in the identified community.            ","CNPI 2b Number of accredited or licensed affordable child care facilities added in the identified community. ","CNPI 3a.1  Commercial","CNPI 4b Number of safe and affordable housing units maintained  and/or improved through WAP or other rehabilitation efforts in the identified community. ","CNPI 5b Number of accessible and affordable behavioral and mental health assets or resources created in the identified community.  ","CNPI 6 G2b Percent increase of donated resources to support the CSBG Eligible Entity's delivery of services and/or implementation of strategies to address conditions of poverty in the identified community. ","CNPI 6 G3b Percent increase of people with low incomes who acquire and maintain leadership roles with the CSBG Eligible Entity or other organizations within the identified community. "]
["CNPI3 Income & Asset Building","CNPI3","CNPI 1c Number of “living wage ” jobs created in the identified community*.","CNPI 2c Number of new Early Childhood Screenings offered to children (ages 0-5) of families with low-incomes in the identified community. ","CNPI 3a.2  Financial","CNPI 4c Number of shelter beds created in the identified community. ","CNPI 5c Number of public safety assets and resources created in the identified community.   ","CNPI 6 G2c  Percent increase of people participating in public hearings, policy forums, community planning, or other advisory boards related to the CSBG Eligible Entity's delivery of service and/or implementation of strategies to address conditions of poverty in the identified community."]
["CNPI4 Housing","CNPI4","CNPI 1d Number of “living wage”  jobs maintained in the  identified community*. ","CNPI 2d Number of accessible and affordable education assets or resources added for school age children in the identified community.  (e.g., academic, enrichment activities, before/after school care, summer programs)","CNPI 3a.3  Technological/ Communications (e.g. broadband)","CNPI 4d Number of shelter beds maintained in the identified community. ","CNPI 5d Number of accessible and affordable healthy food resources created in the identified community."]
["CNPI5 Health & Social/Behavioral","CNPI5","CNPI 1e Number of jobs created in the identified community with a benefit package. ","CNPI 2e Number of accessible and affordable post secondary education assets or resources added for newly graduating youth in the identified community.  (e.g. college tuition, scholarships, vocational training, etc.) ","CNPI 3a.4  Transportation","CNPI 4e Percent decrease in the rate of homelessness in the identified community. ","CNPI 5e Number of activities designed to improve police and community relations within the identified community."]
["CNPI6 Civic Engagement & Community Involvement Goal 2","CNPI6G2","CNPI 1f Percent decrease of the unemployment rate.","CNPI 2f Number of accessible and affordable basic or secondary education assets or resources added for adults in the identified community.  (e.g. literacy, ESL, ABE/GED, etc.) ","CNPI 3a.5  Recreational (e.g. parks, gardens, libraries)","CNPI 4f Percent decrease in the foreclosure rate in the identified community.","CNPI 5f  Percent decrease in infant mortality rate in the identified community."]
["CNPI6 Civic Engagement & Community Involvement Goal 3","CNPI6G3","CNPI 1g Percent decrease of the youth unemployment rate.","CNPI 2g Percent increase of children in the identified community who are kindergarten ready. ","CNPI 3a.6  Other Public Assets/Physical Improvements","CNPI 4g Percent increase in the rate of home ownership of people with low incomes in the identified community.","CNPI 5g  Percent decrease in childhood obesity rate in the identified community. "]
["FNPI1 Employment","FNPI1","CNPI 1h Percent decrease of the underemployment rate.","CNPI 2h Percent increase of children in the identified community at (or above) the basic reading level.","CNPI 3b  Number of existing assets/resources made accessible to the identified community:","CNPI 4h Percent increase of affordable housing in the identified community.","CNPI 5h  Percent decrease in adult obesity rate in the identified community."]
["FNPI2 Education and Cognitive Development","FNPI2",null,"CNPI 2i Percent increase of children in the identified community at (or above) the basic math level.","CNPI 3b.1   Commercial","CNPI 4i Percent increase of shelter beds in the identified community.","CNPI 5i  Percent increase in child immunization rate in the identified community. "]
["FNPI3 Income and Asset Building","FNPI3",null,"CNPI 2j Percent increase in high school (or high school equivalency) graduation rate in the  identified community.","CNPI 3b.2   Financial",null,"CNPI 5j  Percent decrease in uninsured families in the identified community. "]
["FNPI4 Housing","FNPI4",null,"CNPI 2k Percent increase of the rate of youth in the identified community  who attend post-secondary education.","CNPI 3b.3   Technological/ Communications (e.g. broadband)",null,"CNPI 5k  Percent decrease in the teen pregnancy rate in the identified community."]
["FNPI5 Health and Social/Behavioral","FNPI5",null,"CNPI 2l Percent increase of the rate of youth in the identified community who graduate from post-secondary education. ","CNPI 3b.4   Transportation",null,"CNPI 5l  Percent decrease in unplanned pregnancies in the identified community."]
["FNPI6 Civic Engagement and Community Involvement Indicators","FNPI6",null,"CNPI 2m Percent increase of adults in the identified community who attend post-secondary education. ","CNPI 3c  Recreational (e.g. parks, gardens, libraries)",null,"CNPI 5m  Percent decrease in substance abuse rate in the identified community.(e.g. cigarettes, prescription drugs, narcotics, alcohol). "]
[null,null,null,"CNPI 2n Percent increase of adults in the  identified community who graduate from post-secondary education.","CNPI 3d  Other Public Assets/Physical Improvements",null,"CNPI 5n  Percent decrease in domestic violence rate in the identified community."]
[null,null,null,"CNPI 2o Percent increase in the adult literacy rate in the identified community. ","CNPI 3e Percent decrease of abandoned or neglected buildings in the identified community.",null,"CNPI 5o  Percent decrease in the child abuse rate in the identified community."]
[null,null,null,null,"CNPI 3f Percent decrease in emergency response time measured in minutes in the identified community. (EMT, Police, Fire, etc.).",null,"CNPI 5p  Percent decrease in the child neglect rate in the identified community."]
[null,null,null,null,"CNPI 3g Percent decrease of predatory lenders and/or lending practices in the identified community.",null,"CNPI 5q  Percent decrease in the elder abuse rate in the identified community. "]
[null,null,null,null,"CNPI 3h Percent decrease of environmental threats to households (toxic soil, radon, lead, air quality, quality of drinking water, etc.) in the identified community.",null,"CNPI 5r  Percent decrease in the elder neglect rate in the identified community. "]
[null,null,null,null,"CNPI 3i Percent increase of transportation services in the identified community.",null,"CNPI 5s  Percent decrease in recidivism rate in the identified community."]
{"$rows_left_out":173}
{"sheet":"A1-Rev","index":2,"n_rows":27,"n_cols":5,"rows_kept":27,"cut":false,"hidden":false,"merged":[[25,0,25,4],[5,0,6,0],[0,1,0,3],[5,4,6,4],[5,1,6,1],[1,0,1,4],[4,3,4,4]]}
["Subrecipient:"]
["Needs Assessment"]
["Need","Rank","Outcome","Level of Need","Domain"]
[null,1]
[null,null,"Range of NPIs:",{"$f":"VLOOKUP(E4,Lists1!C11:D24,2,FALSE)","v":{"$error":"#N/A"}}]
["Organization Providing Services/Strategies","Method for tracking outcomes?\nYes or No",{"$f":"VLOOKUP(D4,Lists2!A22:B23,2,FALSE)","v":{"$error":"#N/A"}},{"$f":"VLOOKUP(D4,Lists2!A24:B25,2,FALSE)","v":{"$error":"#N/A"}},"County(ies)"]
[null,null,"Service(s) or Strategies Provided","NPIs"]
[]
[]
[]
[]
[]
[]
[]
[]
[]
[]
[]
[]
[]
{"$rows_left_out":8}
{"sheet":"A1.1","index":3,"n_rows":36,"n_cols":5,"rows_kept":36,"cut":false,"hidden":true,"merged":[[31,0,35,0],[31,3,31,4],[32,3,32,4],[34,3,34,4],[35,3,35,4],[19,2,19,4],[20,0,30,0],[20,3,20,4],[21,3,21,4],[22,3,22,4],[23,3,23,4],[27,3,27,4],[28,3,28,4],[29,3,29,4],[13,0,17,0],[13,3,13,4],[14,3,14,4],[16,3,16,4],[17,3,17,4],[0,1,0,3],[1,2,1,4],[2,0,12,0],[2,3,2,4],[3,3,3,4],[4,3,4,4],[5,3,5,4],[9,3,9,4],[10,3,10,4],[11,3,11,4]]}
["Subrecipient:",{"$f":"'A1-Rev'!B1","v":0}]
["Initiative #1","CIS","Community Initiative Status (CIS) Form "]
["Planning",1,"Initiative Name"]
[null,2,"Initiative Year"]
[null,3,"Problem Identification"]
[null,4,"Goal/Agenda"]
[null,5,"Issue/CSBG Community Domains",null,"CNPI1 Employment"]
[null,6,"Ultimate Expected Outcome",{"$f":"VLOOKUP(E7, Lists2!A2:B15, 2, FALSE)","v":"CNPI1"}]
[null,7,"Identified Community"]
[null,8,"Expected Duration"]
[null,9,"Partnership Type"]
[null,10,"Partners"]
[null,11,"Strategy(ies)",null,{"$f":"VLOOKUP(D13,Lists1!C29:D37,2,FALSE)","v":{"$error":"#N/A"}}]
["Reporting and Achievement of Results",12,"Progress on Outcomes/Indicators"]
[null,13,"Impact of Outcomes"]
[null,14,"Outcomes/Indicators to Report",null,{"$f":"VLOOKUP(E7, Lists1!C9:D24, 2, FALSE)","v":"CNPI 1a - CNPI 1h"}]
[null,15,"Final Status"]
[null,16,"Lessons Learned"]
[]
["Initiative #2","CIS","Community Initiative Status (CIS) Form "]
{"$rows_left_out":17}
{"sheet":"A2-Rev","index":4,"n_rows":27,"n_cols":5,"rows_kept":27,"cut":false,"hidden":false,"merged":[[25,0,25,4],[0,1,0,3],[1,0,1,4],[4,3,4,4],[5,0,6,0],[5,1,6,1],[5,4,6,4]]}
["Subrecipient:",{"$f":"'A1-Rev'!B1","v":0}]
["Needs Assessment"]
["Need","Rank","Outcome","Level of Need","Domain"]
[null,2]
[null,null,"Range of NPIs:",{"$f":"VLOOKUP(E4,Lists1!C11:D24,2,FALSE)","v":{"$error":"#N/A"}}]
["Organization Providing Services/Strategies","Method for tracking outcomes?\nYes or No",{"$f":"VLOOKUP(D4,Lists2!A22:B23,2,FALSE)","v":{"$error":"#N/A"}},{"$f":"VLOOKUP(D4,Lists2!A24:B25,2,FALSE)","v":{"$error":"#N/A"}},"County(ies)"]
[null,null,"Service(s) or Strategies Provided","NPIs"]
[]
[]
[]
[]
[]
[]
[]
[]
[]
[]
[]
[]
[]
{"$rows_left_out":8}
{"sheet":"A2.1","index":5,"n_rows":36,"n_cols":5,"rows_kept":36,"cut":false,"hidden":true,"merged":[[31,0,35,0],[31,3,31,4],[32,3,32,4],[34,3,34,4],[35,3,35,4],[19,2,19,4],[20,0,30,0],[20,3,20,4],[21,3,21,4],[22,3,22,4],[23,3,23,4],[27,3,27,4],[28,3,28,4],[29,3,29,4],[0,1,0,3],[2,3,2,4],[3,3,3,4],[4,3,4,4],[5,3,5,4],[1,2,1,4],[2,0,12,0],[13,0,17,0],[13,3,13,4],[14,3,14,4],[16,3,16,4],[17,3,17,4],[9,3,9,4],[10,3,10,4],[11,3,11,4]]}
["Subrecipient:",{"$f":"'A1-Rev'!B1","v":0}]
["Initiative #1","CIS","Community Initiative Status (CIS) Form "]
["Planning",1,"Initiative Name"]
[null,2,"Initiative Year"]
[null,3,"Problem Identification"]
[null,4,"Goal/Agenda"]
[null,5,"Issue/CSBG Community Domains"]
[null,6,"Ultimate Expected Outcome",{"$f":"VLOOKUP(E7, Lists2!A2:B15, 2, FALSE)","v":{"$error":"#N/A"}}]
[null,7,"Identified Community"]
[null,8,"Expected Duration"]
[null,9,"Partnership Type"]
[null,10,"Partners"]
[null,11,"Strategy(ies)",null,{"$f":"VLOOKUP(D13,Lists1!C29:D37,2,FALSE)","v":{"$error":"#N/A"}}]
["Reporting and Achievement of Results",12,"Progress on Outcomes/Indicators"]
[null,13,"Impact of Outcomes"]
[null,14,"Outcomes/Indicators to Report",null,{"$f":"VLOOKUP(E7, Lists1!C9:D24, 2, FALSE)","v":{"$error":"#N/A"}}]
[null,15,"Final Status"]
[null,16,"Lessons Learned"]
[]
["Initiative #2","CIS","Community Initiative Status (CIS) Form "]
{"$rows_left_out":17}
{"sheet":"A3-Rev","index":6,"n_rows":27,"n_cols":5,"rows_kept":27,"cut":false,"hidden":false,"merged":[[25,0,25,4],[0,1,0,3],[1,0,1,4],[4,3,4,4],[5,0,6,0],[5,1,6,1],[5,4,6,4]]}
["Subrecipient:",{"$f":"'A1-Rev'!B1","v":0}]
["Needs Assessment"]
["Need","Rank","Outcome","Level of Need","Domain"]
[null,3]
[null,null,"Range of NPIs:",{"$f":"VLOOKUP(E4,Lists1!C11:D24,2,FALSE)","v":{"$error":"#N/A"}}]
["Organization Providing Services/Strategies","Method for tracking outcomes?\nYes or No",{"$f":"VLOOKUP(D4,Lists2!A22:B23,2,FALSE)","v":{"$error":"#N/A"}},{"$f":"VLOOKUP(D4,Lists2!A24:B25,2,FALSE)","v":{"$error":"#N/A"}},"County(ies)"]
[null,null,"Service(s) or Strategies Provided","NPIs"]
[]
[]
[]
[]
[]
[]
[]
[]
[]
[]
[]
[]
[]
{"$rows_left_out":8}
{"sheet":"A3.1","index":7,"n_rows":36,"n_cols":5,"rows_kept":36,"cut":false,"hidden":true,"merged":[[31,0,35,0],[31,3,31,4],[32,3,32,4],[34,3,34,4],[35,3,35,4],[19,2,19,4],[20,0,30,0],[20,3,20,4],[21,3,21,4],[22,3,22,4],[23,3,23,4],[27,3,27,4],[28,3,28,4],[29,3,29,4],[13,0,17,0],[13,3,13,4],[14,3,14,4],[16,3,16,4],[17,3,17,4],[0,1,0,3],[1,2,1,4],[2,0,12,0],[2,3,2,4],[3,3,3,4],[4,3,4,4],[5,3,5,4],[9,3,9,4],[10,3,10,4],[11,3,11,4]]}
["Subrecipient:",{"$f":"'A1-Rev'!B1","v":0}]
["Initiative #1","CIS","Community Initiative Status (CIS) Form "]
["Planning",1,"Initiative Name"]
[null,2,"Initiative Year"]
[null,3,"Problem Identification"]
[null,4,"Goal/Agenda"]
[null,5,"Issue/CSBG Community Domains"]
[null,6,"Ultimate Expected Outcome",{"$f":"VLOOKUP(E7, Lists2!A2:B15, 2, FALSE)","v":{"$error":"#N/A"}}]
[null,7,"Identified Community"]
[null,8,"Expected Duration"]
[null,9,"Partnership Type"]
[null,10,"Partners"]
[null,11,"Strategy(ies)",null,{"$f":"VLOOKUP(D13,Lists1!C29:D37,2,FALSE)","v":{"$error":"#N/A"}}]
["Reporting and Achievement of Results",12,"Progress on Outcomes/Indicators"]
[null,13,"Impact of Outcomes"]
[null,14,"Outcomes/Indicators to Report",null,{"$f":"VLOOKUP(E7, Lists1!C9:D24, 2, FALSE)","v":{"$error":"#N/A"}}]
[null,15,"Final Status"]
[null,16,"Lessons Learned"]
[]
["Initiative #2","CIS","Community Initiative Status (CIS) Form "]
{"$rows_left_out":17}
{"sheet":"A4-Rev","index":8,"n_rows":27,"n_cols":5,"rows_kept":27,"cut":false,"hidden":false,"merged":[[25,0,25,4],[0,1,0,3],[1,0,1,4],[4,3,4,4],[5,0,6,0],[5,1,6,1],[5,4,6,4]]}
["Subrecipient:",{"$f":"'A1-Rev'!B1","v":0}]
["Needs Assessment"]
["Need","Rank","Outcome","Level of Need","Domain"]
[null,4]
[null,null,"Range of NPIs:",{"$f":"VLOOKUP(E4,Lists1!C11:D24,2,FALSE)","v":{"$error":"#N/A"}}]
["Organization Providing Services/Strategies","Method for tracking outcomes?\nYes or No",{"$f":"VLOOKUP(D4,Lists2!A22:B23,2,FALSE)","v":{"$error":"#N/A"}},{"$f":"VLOOKUP(D4,Lists2!A24:B25,2,FALSE)","v":{"$error":"#N/A"}},"County(ies)"]
[null,null,"Service(s) or Strategies Provided","NPIs"]
[]
[]
[]
[]
[]
[]
[]
[]
[]
[]
[]
[]
[]
{"$rows_left_out":8}
{"sheet":"A4.1","index":9,"n_rows":36,"n_cols":5,"rows_kept":36,"cut":false,"hidden":true,"merged":[[31,0,35,0],[31,3,31,4],[32,3,32,4],[34,3,34,4],[35,3,35,4],[19,2,19,4],[20,0,30,0],[20,3,20,4],[21,3,21,4],[22,3,22,4],[23,3,23,4],[27,3,27,4],[28,3,28,4],[29,3,29,4],[13,0,17,0],[13,3,13,4],[14,3,14,4],[16,3,16,4],[17,3,17,4],[0,1,0,3],[1,2,1,4],[2,0,12,0],[2,3,2,4],[3,3,3,4],[4,3,4,4],[5,3,5,4],[9,3,9,4],[10,3,10,4],[11,3,11,4]]}
["Subrecipient:",{"$f":"'A1-Rev'!B1","v":0}]
["Initiative #1","CIS","Community Initiative Status (CIS) Form "]
["Planning",1,"Initiative Name"]
[null,2,"Initiative Year"]
[null,3,"Problem Identification"]
[null,4,"Goal/Agenda"]
[null,5,"Issue/CSBG Community Domains"]
[null,6,"Ultimate Expected Outcome",{"$f":"VLOOKUP(E7, Lists2!A2:B15, 2, FALSE)","v":{"$error":"#N/A"}}]
[null,7,"Identified Community"]
[null,8,"Expected Duration"]
[null,9,"Partnership Type"]
[null,10,"Partners"]
[null,11,"Strategy(ies)",null,{"$f":"VLOOKUP(D13,Lists1!C29:D37,2,FALSE)","v":{"$error":"#N/A"}}]
["Reporting and Achievement of Results",12,"Progress on Outcomes/Indicators"]
[null,13,"Impact of Outcomes"]
[null,14,"Outcomes/Indicators to Report",null,{"$f":"VLOOKUP(E7, Lists1!C9:D24, 2, FALSE)","v":{"$error":"#N/A"}}]
[null,15,"Final Status"]
[null,16,"Lessons Learned"]
[]
["Initiative #2","CIS","Community Initiative Status (CIS) Form "]
{"$rows_left_out":17}
{"sheet":"A5-Rev","index":10,"n_rows":27,"n_cols":5,"rows_kept":27,"cut":false,"hidden":false,"merged":[[25,0,25,4],[0,1,0,3],[1,0,1,4],[4,3,4,4],[5,0,6,0],[5,1,6,1],[5,4,6,4]]}
["Subrecipient:",{"$f":"'A1-Rev'!B1","v":0}]
["Needs Assessment"]
["Need","Rank","Outcome","Level of Need","Domain"]
[null,5]
[null,null,"Range of NPIs:",{"$f":"VLOOKUP(E4,Lists1!C11:D24,2,FALSE)","v":{"$error":"#N/A"}}]
["Organization Providing Services/Strategies","Method for tracking outcomes?\nYes or No",{"$f":"VLOOKUP(D4,Lists2!A22:B23,2,FALSE)","v":{"$error":"#N/A"}},{"$f":"VLOOKUP(D4,Lists2!A24:B25,2,FALSE)","v":{"$error":"#N/A"}},"County(ies)"]
[null,null,"Service(s) or Strategies Provided","NPIs"]
[]
[]
[]
[]
[]
[]
[]
[]
[]
[]
[]
[]
[]
{"$rows_left_out":8}
{"sheet":"A5.1","index":11,"n_rows":36,"n_cols":5,"rows_kept":36,"cut":false,"hidden":true,"merged":[[31,0,35,0],[31,3,31,4],[32,3,32,4],[34,3,34,4],[35,3,35,4],[19,2,19,4],[20,0,30,0],[20,3,20,4],[21,3,21,4],[22,3,22,4],[23,3,23,4],[27,3,27,4],[28,3,28,4],[29,3,29,4],[13,0,17,0],[13,3,13,4],[14,3,14,4],[16,3,16,4],[17,3,17,4],[0,1,0,3],[1,2,1,4],[2,0,12,0],[2,3,2,4],[3,3,3,4],[4,3,4,4],[5,3,5,4],[9,3,9,4],[10,3,10,4],[11,3,11,4]]}
["Subrecipient:",{"$f":"'A1-Rev'!B1","v":0}]
["Initiative #1","CIS","Community Initiative Status (CIS) Form "]
["Planning",1,"Initiative Name"]
[null,2,"Initiative Year"]
[null,3,"Problem Identification"]
[null,4,"Goal/Agenda"]
[null,5,"Issue/CSBG Community Domains"]
[null,6,"Ultimate Expected Outcome",{"$f":"VLOOKUP(E7, Lists2!A2:B15, 2, FALSE)","v":{"$error":"#N/A"}}]
[null,7,"Identified Community"]
[null,8,"Expected Duration"]
[null,9,"Partnership Type"]
[null,10,"Partners"]
[null,11,"Strategy(ies)",null,{"$f":"VLOOKUP(D13,Lists1!C29:D37,2,FALSE)","v":{"$error":"#N/A"}}]
["Reporting and Achievement of Results",12,"Progress on Outcomes/Indicators"]
[null,13,"Impact of Outcomes"]
[null,14,"Outcomes/Indicators to Report",null,{"$f":"VLOOKUP(E7, Lists1!C9:D24, 2, FALSE)","v":{"$error":"#N/A"}}]
[null,15,"Final Status"]
[null,16,"Lessons Learned"]
[]
["Initiative #2","CIS","Community Initiative Status (CIS) Form "]
{"$rows_left_out":17}
{"sheet":"Section B1-B3 Rev","index":12,"n_rows":21,"n_cols":4,"rows_kept":21,"cut":false,"hidden":false,"merged":[[20,0,20,3],[11,0,12,2],[11,3,12,3],[17,0,17,3],[18,0,18,1],[18,2,18,3],[19,0,19,1],[19,2,19,3],[6,0,6,3],[7,0,7,2],[7,3,8,3],[8,0,8,2],[9,0,10,2],[9,3,10,3],[0,1,0,2],[1,0,1,3],[2,0,2,3],[3,0,3,3],[4,0,4,3],[5,0,5,3]]}
["Subrecipient:",{"$f":"'A1-Rev'!B1:D1","v":0}]
["Section B1: Provision of Nutritious Foods and Initiatives"]
["Provision of Nutritious Foods: Describe how the Subrecipient will provide, on an emergency basis, such supplies and services, nutritious foods, and related services, as may be necessary to counteract the conditions of starvation and malnutrition among low-income individuals."]
[]
["Initiatives: Describe the use of CSBG funds to support innovative community and neighborhood-based initiatives related to the purposes of CSBG, which may include fatherhood initiatives and other initiatives with the goal of strengthening families and encouraging effective parenting."]
[]
["Section B2: Case Management Services and Caseload"]
["1. Have all case managers completed the case management training video series through the TDHCA website, or attended case management training?"]
["http://www.tdhca.state.tx.us/community-affairs/csbg/case-management-training-series.htm"]
["2. Do the case managers have appropriate documentation of their case management process in their client files?"]
[]
["3. How often are the case managers evaluated, by supervisors, towards their TOP goals?"]
[]
[]
["Number of Case Managers",null,"Average Household Size"]
["Agency TOP Goal assigned by State",null,"Minimum Number of Clients per Case Manager to TOP",{"$f":"(B16/D15)/B15","v":{"$error":"#DIV/0!"}}]
[]
["Section B3: Referral Organizations"]
["Referral Organizations",null,"Social Service Coalitions"]
["Child Support Offices",null,"Texas Workforce Commission Offices"]
{"$rows_left_out":2}
{"sheet":"Referrals and Partners-Rev","index":13,"n_rows":1,"n_cols":26,"rows_kept":1,"cut":false,"hidden":false,"merged":[]}
["County Served","Organization Name","Address","City/Town","Zip","Phone","Contact Person","Email","Website","Employment","Job Skills/Training","Education","Income","Housing","Healthcare","Food","Utilities","Child Care","Clothing","Transportation","State Organization","CoC/CRCG","Additional Services Provided","Referral Only","Working  Partnership","MOU/ Contract"]

{"sheet":"Service Locations-Rev","index":14,"n_rows":55,"n_cols":6,"rows_kept":55,"cut":false,"hidden":false,"merged":[[0,1,0,5],[30,0,33,0],[30,1,30,4],[31,1,31,4],[32,1,32,4],[33,1,33,4]]}
["Subrecipient:",{"$f":"'A1-Rev'!B1","v":0}]
["CSBG Service Area County/Zip Code","Number of HH in Poverty by County/Zip Code","% of HH in Poverty","Main Office\n(Yes or No)","Service Center\n(Yes or No)","Outreach\n(Yes or No)"]
[null,null,{"$f":"B3/B55","v":{"$error":"#DIV/0!"}}]
[null,null,{"$f":"B4/B55","v":{"$error":"#DIV/0!"}}]
[null,null,{"$f":"B5/B55","v":{"$error":"#DIV/0!"}}]
[null,null,{"$f":"B6/B55","v":{"$error":"#DIV/0!"}}]
[null,null,{"$f":"B7/B55","v":{"$error":"#DIV/0!"}}]
[null,null,{"$f":"B8/B55","v":{"$error":"#DIV/0!"}}]
[null,null,{"$f":"B9/B55","v":{"$error":"#DIV/0!"}}]
[null,null,{"$f":"B10/B55","v":{"$error":"#DIV/0!"}}]
[null,null,{"$f":"B11/B55","v":{"$error":"#DIV/0!"}}]
[null,null,{"$f":"B12/B55","v":{"$error":"#DIV/0!"}}]
[null,null,{"$f":"B13/B55","v":{"$error":"#DIV/0!"}}]
[null,null,{"$f":"B14/B55","v":{"$error":"#DIV/0!"}}]
[null,null,{"$f":"B15/B55","v":{"$error":"#DIV/0!"}}]
[null,null,{"$f":"B16/B55","v":{"$error":"#DIV/0!"}}]
[null,null,{"$f":"B17/B55","v":{"$error":"#DIV/0!"}}]
[null,null,{"$f":"B18/B55","v":{"$error":"#DIV/0!"}}]
[null,null,{"$f":"B19/B55","v":{"$error":"#DIV/0!"}}]
[null,null,{"$f":"B20/B55","v":{"$error":"#DIV/0!"}}]
{"$rows_left_out":35}